{"text_format":"1","workbook":"xlsx","n_sheets":2,"sheets":["MessageTable","Sheet2"],"not_rendered":{"charts":0,"images":3,"macros":1,"external_links":0,"defined_names":1,"comments":0,"pivot_tables":0},"unopened":[],"bounds":{"document_bytes":16777216,"sheet_cells":100000,"rows_first":2000,"rows_last":500,"rows_between":2000,"halvings":0,"cell_chars":16384,"cell_head_chars":4096},"cells_cut":0,"cells_raw":0,"read":"whole","date_system":"1900"}

{"sheet":"MessageTable","index":0,"n_rows":30,"n_cols":6,"rows_kept":30,"cut":false,"hidden":false,"merged":[]}
[]
[null,"级别","类别","信息名","信息代码","信息编码"]
[null,"错误","通用","参数不正确","ILLEGAL_ARGUMENTS",{"$f":"IF(B3=\"\",\"\",EVALUATE(\"Sheet2!$B$\"&MATCH(B3,Sheet2!A:A,0))&EVALUATE(\"Sheet2!$D$\"&MATCH(C3,Sheet2!C:C,0))&TEXT(COUNTIFS(C$1:C2,C3,$B$1:B2,B3),\"000\"))","v":"EG000"}]
[null,"错误","通用","发生系统错误，详情请查阅日志","SYSTEM_ERROR",{"$f":"IF(B4=\"\",\"\",EVALUATE(\"Sheet2!$B$\"&MATCH(B4,Sheet2!A:A,0))&EVALUATE(\"Sheet2!$D$\"&MATCH(C4,Sheet2!C:C,0))&TEXT(COUNTIFS(C$1:C3,C4,$B$1:B3,B4),\"000\"))","v":"EG001"}]
[null,"错误","通用","发生未知错误","UNCAUGHT_ERROR",{"$f":"IF(B5=\"\",\"\",EVALUATE(\"Sheet2!$B$\"&MATCH(B5,Sheet2!A:A,0))&EVALUATE(\"Sheet2!$D$\"&MATCH(C5,Sheet2!C:C,0))&TEXT(COUNTIFS(C$1:C4,C5,$B$1:B4,B5),\"000\"))","v":"EG002"}]
[null,"错误","数据库","数据库执行错误，详情请查阅日志","DATABASE_QUERY_ERROR",{"$f":"IF(B6=\"\",\"\",EVALUATE(\"Sheet2!$B$\"&MATCH(B6,Sheet2!A:A,0))&EVALUATE(\"Sheet2!$D$\"&MATCH(C6,Sheet2!C:C,0))&TEXT(COUNTIFS(C$1:C5,C6,$B$1:B5,B6),\"000\"))","v":"ED000"}]
[null,"提示","用户","添加用户成功","ADD_USER_SUCCEED",{"$f":"IF(B7=\"\",\"\",EVALUATE(\"Sheet2!$B$\"&MATCH(B7,Sheet2!A:A,0))&EVALUATE(\"Sheet2!$D$\"&MATCH(C7,Sheet2!C:C,0))&TEXT(COUNTIFS(C$1:C6,C7,$B$1:B6,B7),\"000\"))","v":"IU000"}]
[null,"错误","用户","添加用户失败","ADD_USER_FAILED",{"$f":"IF(B8=\"\",\"\",EVALUATE(\"Sheet2!$B$\"&MATCH(B8,Sheet2!A:A,0))&EVALUATE(\"Sheet2!$D$\"&MATCH(C8,Sheet2!C:C,0))&TEXT(COUNTIFS(C$1:C7,C8,$B$1:B7,B8),\"000\"))","v":"EU000"}]
[null,"错误","用户","找不到该用户","USER_NOT_FOUND",{"$f":"IF(B9=\"\",\"\",EVALUATE(\"Sheet2!$B$\"&MATCH(B9,Sheet2!A:A,0))&EVALUATE(\"Sheet2!$D$\"&MATCH(C9,Sheet2!C:C,0))&TEXT(COUNTIFS(C$1:C8,C9,$B$1:B8,B9),\"000\"))","v":"EU001"}]
[null,"警告","用户","该用户名已被占用","USERNAME_HAS_USED",{"$f":"IF(B10=\"\",\"\",EVALUATE(\"Sheet2!$B$\"&MATCH(B10,Sheet2!A:A,0))&EVALUATE(\"Sheet2!$D$\"&MATCH(C10,Sheet2!C:C,0))&TEXT(COUNTIFS(C$1:C9,C10,$B$1:B9,B10),\"000\"))","v":"WU000"}]
[null,"错误","用户","用户名或密码错误","USERNAME_OR_PASSWORD_ERROR",{"$f":"IF(B11=\"\",\"\",EVALUATE(\"Sheet2!$B$\"&MATCH(B11,Sheet2!A:A,0))&EVALUATE(\"Sheet2!$D$\"&MATCH(C11,Sheet2!C:C,0))&TEXT(COUNTIFS(C$1:C10,C11,$B$1:B10,B11),\"000\"))","v":"EU002"}]
[null,"警告","用户","用户已被禁封","USER_HAS_BANNED",{"$f":"IF(B12=\"\",\"\",EVALUATE(\"Sheet2!$B$\"&MATCH(B12,Sheet2!A:A,0))&EVALUATE(\"Sheet2!$D$\"&MATCH(C12,Sheet2!C:C,0))&TEXT(COUNTIFS(C$1:C11,C12,$B$1:B11,B12),\"000\"))","v":"WU001"}]
[null,"提示","用户","编辑用户成功","EDIT_USER_SUCCEED",{"$f":"IF(B13=\"\",\"\",EVALUATE(\"Sheet2!$B$\"&MATCH(B13,Sheet2!A:A,0))&EVALUATE(\"Sheet2!$D$\"&MATCH(C13,Sheet2!C:C,0))&TEXT(COUNTIFS(C$1:C12,C13,$B$1:B12,B13),\"000\"))","v":"IU001"}]
[null,"错误","用户","编辑用户失败","EDIT_USER_FAILED",{"$f":"IF(B14=\"\",\"\",EVALUATE(\"Sheet2!$B$\"&MATCH(B14,Sheet2!A:A,0))&EVALUATE(\"Sheet2!$D$\"&MATCH(C14,Sheet2!C:C,0))&TEXT(COUNTIFS(C$1:C13,C14,$B$1:B13,B14),\"000\"))","v":"EU003"}]
[null,"警告","用户","用户名不能为空","NO_EMPTY_USERNAME",{"$f":"IF(B15=\"\",\"\",EVALUATE(\"Sheet2!$B$\"&MATCH(B15,Sheet2!A:A,0))&EVALUATE(\"Sheet2!$D$\"&MATCH(C15,Sheet2!C:C,0))&TEXT(COUNTIFS(C$1:C14,C15,$B$1:B14,B15),\"000\"))","v":"WU002"}]
[null,"警告","用户","密码不能为空","NO_EMPTY_PASSWORD",{"$f":"IF(B16=\"\",\"\",EVALUATE(\"Sheet2!$B$\"&MATCH(B16,Sheet2!A:A,0))&EVALUATE(\"Sheet2!$D$\"&MATCH(C16,Sheet2!C:C,0))&TEXT(COUNTIFS(C$1:C15,C16,$B$1:B15,B16),\"000\"))","v":"WU003"}]
[null,"提示","用户","登录成功","LOGIN_SUCCEED",{"$f":"IF(B17=\"\",\"\",EVALUATE(\"Sheet2!$B$\"&MATCH(B17,Sheet2!A:A,0))&EVALUATE(\"Sheet2!$D$\"&MATCH(C17,Sheet2!C:C,0))&TEXT(COUNTIFS(C$1:C16,C17,$B$1:B16,B17),\"000\"))","v":"IU002"}]
[null,"提示","用户","登录失败，请重新登录","LOGIN_FAILED",{"$f":"IF(B18=\"\",\"\",EVALUATE(\"Sheet2!$B$\"&MATCH(B18,Sheet2!A:A,0))&EVALUATE(\"Sheet2!$D$\"&MATCH(C18,Sheet2!C:C,0))&TEXT(COUNTIFS(C$1:C17,C18,$B$1:B17,B18),\"000\"))","v":"IU003"}]
[null,"提示","业务","处理执行成功","QUERY_SUCCEED",{"$f":"IF(B19=\"\",\"\",EVALUATE(\"Sheet2!$B$\"&MATCH(B19,Sheet2!A:A,0))&EVALUATE(\"Sheet2!$D$\"&MATCH(C19,Sheet2!C:C,0))&TEXT(COUNTIFS(C$1:C18,C19,$B$1:B18,B19),\"000\"))","v":"IB000"}]
[null,"警告","业务","处理执行失败","QUERY_FAILED",{"$f":"IF(B20=\"\",\"\",EVALUATE(\"Sheet2!$B$\"&MATCH(B20,Sheet2!A:A,0))&EVALUATE(\"Sheet2!$D$\"&MATCH(C20,Sheet2!C:C,0))&TEXT(COUNTIFS(C$1:C19,C20,$B$1:B19,B20),\"000\"))","v":"WB000"}]
[null,"错误","业务","页面初始化失败","PAGE_INITIAL_FAILED",{"$f":"IF(B21=\"\",\"\",EVALUATE(\"Sheet2!$B$\"&MATCH(B21,Sheet2!A:A,0))&EVALUATE(\"Sheet2!$D$\"&MATCH(C21,Sheet2!C:C,0))&TEXT(COUNTIFS(C$1:C27,C21,$B$1:B27,B21),\"000\"))","v":"EB001"}]
[null,"提示","数据库","数据插入成功","DATA_INSERT_SUCCEED",{"$f":"IF(B22=\"\",\"\",EVALUATE(\"Sheet2!$B$\"&MATCH(B22,Sheet2!A:A,0))&EVALUATE(\"Sheet2!$D$\"&MATCH(C22,Sheet2!C:C,0))&TEXT(COUNTIFS(C$1:C20,C22,$B$1:B20,B22),\"000\"))","v":"ID000"}]
[null,"警告","数据库","数据插入失败","DATA_INSERT_FAILED",{"$f":"IF(B23=\"\",\"\",EVALUATE(\"Sheet2!$B$\"&MATCH(B23,Sheet2!A:A,0))&EVALUATE(\"Sheet2!$D$\"&MATCH(C23,Sheet2!C:C,0))&TEXT(COUNTIFS(C$1:C22,C23,$B$1:B22,B23),\"000\"))","v":"WD000"}]
[null,"提示","数据库","数据更新成功","DATA_UPDATE_SUCCEED",{"$f":"IF(B24=\"\",\"\",EVALUATE(\"Sheet2!$B$\"&MATCH(B24,Sheet2!A:A,0))&EVALUATE(\"Sheet2!$D$\"&MATCH(C24,Sheet2!C:C,0))&TEXT(COUNTIFS(C$1:C23,C24,$B$1:B23,B24),\"000\"))","v":"ID001"}]
[null,"警告","数据库","数据更新失败","DATA_UPDATE_FAILED",{"$f":"IF(B25=\"\",\"\",EVALUATE(\"Sheet2!$B$\"&MATCH(B25,Sheet2!A:A,0))&EVALUATE(\"Sheet2!$D$\"&MATCH(C25,Sheet2!C:C,0))&TEXT(COUNTIFS(C$1:C24,C25,$B$1:B24,B25),\"000\"))","v":"WD001"}]
[null,"提示","数据库","数据删除成功","DATA_DELETE_SUCCEED",{"$f":"IF(B26=\"\",\"\",EVALUATE(\"Sheet2!$B$\"&MATCH(B26,Sheet2!A:A,0))&EVALUATE(\"Sheet2!$D$\"&MATCH(C26,Sheet2!C:C,0))&TEXT(COUNTIFS(C$1:C25,C26,$B$1:B25,B26),\"000\"))","v":"ID002"}]
[null,"警告","数据库","数据删除失败","DATA_DELETE_FAILED",{"$f":"IF(B27=\"\",\"\",EVALUATE(\"Sheet2!$B$\"&MATCH(B27,Sheet2!A:A,0))&EVALUATE(\"Sheet2!$D$\"&MATCH(C27,Sheet2!C:C,0))&TEXT(COUNTIFS(C$1:C26,C27,$B$1:B26,B27),\"000\"))","v":"WD002"}]
[null,"错误","硬件","网络错误，详情请查阅日志","NETWORD_EXCEPTION",{"$f":"IF(B28=\"\",\"\",EVALUATE(\"Sheet2!$B$\"&MATCH(B28,Sheet2!A:A,0))&EVALUATE(\"Sheet2!$D$\"&MATCH(C28,Sheet2!C:C,0))&TEXT(COUNTIFS(C$1:C21,C28,$B$1:B21,B28),\"000\"))","v":"EH000"}]
[null,"错误","代码","JSON格式错误","JSON_FORMAT_ERROR",{"$f":"IF(B29=\"\",\"\",EVALUATE(\"Sheet2!$B$\"&MATCH(B29,Sheet2!A:A,0))&EVALUATE(\"Sheet2!$D$\"&MATCH(C29,Sheet2!C:C,0))&TEXT(COUNTIFS(C$1:C28,C29,$B$1:B28,B29),\"000\"))","v":"EC000"}]
[null,null,null,null,null,{"$f":"IF(B30=\"\",\"\",EVALUATE(\"Sheet2!$B$\"&MATCH(B30,Sheet2!A:A,0))&EVALUATE(\"Sheet2!$D$\"&MATCH(C30,Sheet2!C:C,0))&TEXT(COUNTIFS(C$1:C29,C30,$B$1:B29,B30),\"000\"))","v":""}]

{"sheet":"Sheet2","index":1,"n_rows":8,"n_cols":4,"rows_kept":8,"cut":false,"hidden":false,"merged":[]}
["级别",null,"分类"]
["提示","I","通用","G"]
["警告","W","数据库","D"]
["错误","E","类库","L"]
[null,null,"业务","B"]
[null,null,"代码","C"]
[null,null,"用户","U"]
[null,null,"硬件","H"]